Reaction Details
TargetArachidonate 5-lipoxygenase-activating protein
LigandBDBM169123
Substrate/Competitorn/a
Meas. Tech.Homogeneous Time Resolved Fluorescence Assay
Ki 1±n/a nM
Citation Bacani, GMEccles, WFitzgerald, AEGoldberg, SDHack, MDHawryluk, NAJones, WMKeith, JMKrawczuk, PLebsack, ADLee-Dutra, ALiu, JMcClure, KJMeduna, SPPippel, DJRosen, MDSales, ZS Flap modulators US Patent US9079866 Publication Date 7/14/2015
 
Arachidonate 5-lipoxygenase-activating protein
Name:Arachidonate 5-lipoxygenase-activating protein
Type:Enzyme
Mol. Mass.:18159.90
Organism:Homo sapiens (Human)
Description:P20292
Residue:161
BDBM169123
NameBDBM169123
Synonyms:US9079866, 524 US9884878, Compound 524
TypeSmall organic molecule
Emp. Form.C23H16FN5O
Mol. Mass.397.4044
SMILESNc1ccnc(Oc2ccccc2-c2ccc(c(F)c2)-c2cnc3[nH]ccc3c2)n1