Reaction Details
TargetArachidonate 5-lipoxygenase-activating protein
LigandBDBM169134
Substrate/Competitorn/a
Meas. Tech.Homogeneous Time Resolved Fluorescence Assay
Ki 1±n/a nM
Citation Bacani, GMEccles, WFitzgerald, AEGoldberg, SDHack, MDHawryluk, NAJones, WMKeith, JMKrawczuk, PLebsack, ADLee-Dutra, ALiu, JMcClure, KJMeduna, SPPippel, DJRosen, MDSales, ZS Flap modulators US Patent US9079866 Publication Date 7/14/2015
 
Arachidonate 5-lipoxygenase-activating protein
Name:Arachidonate 5-lipoxygenase-activating protein
Type:Enzyme
Mol. Mass.:18159.90
Organism:Homo sapiens (Human)
Description:P20292
Residue:161
BDBM169134
NameBDBM169134
Synonyms:US9079866, 535 US9884878, Compound 535
TypeSmall organic molecule
Emp. Form.C20H15FN6O
Mol. Mass.374.3711
SMILESNc1cnc(cn1)-c1ccc(cc1F)-c1ccccc1Oc1cc(N)ncn1