Reaction Details
TargetSodium channel protein type 9 subunit alpha
LigandBDBM170177
Substrate/Competitorn/a
Meas. Tech.In Vitro Assay
IC50 147±n/a nM
Citation Dineen, TMarx, IENguyen, HNWeiss, M Heteroaryl sodium channel inhibitors US Patent US9079902 Publication Date 7/14/2015
 
Sodium channel protein type 9 subunit alpha
Name:Sodium channel protein type 9 subunit alpha
Type:Protein
Mol. Mass.:226375.97
Organism:Homo sapiens (Human)
Description:Q15858
Residue:1988
BDBM170177
NameBDBM170177
Synonyms:US9079902, 8
TypeSmall organic molecule
Emp. Form.C22H17F3N6O2S2
Mol. Mass.518.535
SMILESCn1nccc1-c1cc(ccc1-c1cn(C)c2cc(ccc12)S(=O)(=O)Nc1ncns1)C(F)(F)F