Reaction Details
TargetSodium-dependent noradrenaline transporter
LigandBDBM60513
Substrate/Competitorn/a
Meas. Tech.Binding Assay
pH7.4±n/a
Ki 4.1±n/a nM
Commentsextracted
Citation Molino, BFLiu, SGuzzo, PRBeck, JP Aryl- and heteroaryl-substituted tetrahydroisoquinolines and use thereof to block reuptake of norepinephrine, dopamine, and serotonin US Patent US9085531 Publication Date 7/21/2015
 
Sodium-dependent noradrenaline transporter
Name:Sodium-dependent noradrenaline transporter
Type:Multi-pass membrane protein
Mol. Mass.:69337.72
Organism:Homo sapiens (Human)
Description:P23975
Residue:617
BDBM60513
NameBDBM60513
Synonyms:US9085531, 137
Typen/a
Emp. Form.C24H21N3
Mol. Mass.351.4436
SMILESCN1CC(c2ccc3ccccc3c2)c2ccc(cc2C1)-c1cccnn1