Reaction Details
TargetSodium-dependent noradrenaline transporter
LigandBDBM170452
Substrate/Competitorn/a
Meas. Tech.Binding Assay
pH7.4±n/a
Ki 1.4±n/a nM
Commentsextracted
Citation Molino, BFLiu, SGuzzo, PRBeck, JP Aryl- and heteroaryl-substituted tetrahydroisoquinolines and use thereof to block reuptake of norepinephrine, dopamine, and serotonin US Patent US9085531 Publication Date 7/21/2015
 
Sodium-dependent noradrenaline transporter
Name:Sodium-dependent noradrenaline transporter
Type:Multi-pass membrane protein
Mol. Mass.:69337.72
Organism:Homo sapiens (Human)
Description:P23975
Residue:617
BDBM170452
NameBDBM170452
Synonyms:US9085531, 97
TypeSmall organic molecule
Emp. Form.C22H19N3S
Mol. Mass.357.471
SMILESCN1CC(c2ccc3sccc3c2)c2ccc(cc2C1)-c1cccnn1