Reaction Details
TargetSodium-dependent serotonin transporter
LigandBDBM170454
Substrate/Competitorn/a
Meas. Tech.Binding Assay
pH7.4±n/a
Ki 3.4±n/a nM
Commentsextracted
Citation Molino, BFLiu, SGuzzo, PRBeck, JP Aryl- and heteroaryl-substituted tetrahydroisoquinolines and use thereof to block reuptake of norepinephrine, dopamine, and serotonin US Patent US9085531 Publication Date 7/21/2015
 
Sodium-dependent serotonin transporter
Name:Sodium-dependent serotonin transporter
Type:Multi-pass membrane protein
Mol. Mass.:70322.51
Organism:Homo sapiens (Human)
Description:P31645
Residue:630
BDBM170454
NameBDBM170454
Synonyms:US9085531, 102
TypeSmall organic molecule
Emp. Form.C21H24N2S
Mol. Mass.336.494
SMILESCN(C)Cc1ccc2C(CN(C)Cc2c1)c1ccc2sccc2c1