Reaction Details
TargetSodium-dependent dopamine transporter
LigandBDBM287935
Substrate/Competitorn/a
Meas. Tech.Assay for Dopamine Reuptake Inhibition
pH7.4±n/a
EC50 22.0±6 nM
Commentsextracted
Citation Ananthan, SRothman, RB Quinazolines as biogenic amine transport modulators US Patent US10087148 Publication Date 10/2/2018
 
Sodium-dependent dopamine transporter
Name:Sodium-dependent dopamine transporter
Type:Multi-pass membrane protein
Mol. Mass.:68497.11
Organism:Homo sapiens (Human)
Description:Q01959
Residue:620
BDBM287935
NameBDBM287935
Synonyms:2-(4-(dimethylamino)phenyl)-N-(2- phenyl-2-(pyridin-2- yl)ethyl)quinazolin-4-amine | US10087148, Example 3
TypeSmall organic molecule
Emp. Form.C29H27N5
Mol. Mass.445.5582
SMILESCN(C)c1ccc(cc1)-c1nc(NCC(c2ccccc2)c2ccccn2)c2ccccc2n1