Reaction Details
TargetSodium-dependent dopamine transporter
LigandBDBM287936
Substrate/Competitorn/a
Meas. Tech.Assay for Dopamine Reuptake Inhibition
pH7.4±n/a
EC50 11.0±2 nM
Commentsextracted
Citation Ananthan, SRothman, RB Quinazolines as biogenic amine transport modulators US Patent US10087148 Publication Date 10/2/2018
 
Sodium-dependent dopamine transporter
Name:Sodium-dependent dopamine transporter
Type:Multi-pass membrane protein
Mol. Mass.:68497.11
Organism:Homo sapiens (Human)
Description:Q01959
Residue:620
BDBM287936
NameBDBM287936
Synonyms:N-(4-(4-((2-hydroxy-2,2- diphenylethyl)amino)quinazolin-2- yl)phenyl)methanesulfonamide | US10087148, Example 4
TypeSmall organic molecule
Emp. Form.C29H26N4O3S
Mol. Mass.510.607
SMILESCS(=O)(=O)Nc1ccc(cc1)-c1nc(NCC(O)(c2ccccc2)c2ccccc2)c2ccccc2n1