Reaction Details
TargetSodium-dependent dopamine transporter
LigandBDBM287946
Substrate/Competitorn/a
Meas. Tech.Assay for Dopamine Reuptake Inhibition
pH7.4±n/a
EC50 5.60±2.1 nM
Commentsextracted
Citation Ananthan, SRothman, RB Quinazolines as biogenic amine transport modulators US Patent US10087148 Publication Date 10/2/2018
 
Sodium-dependent dopamine transporter
Name:Sodium-dependent dopamine transporter
Type:Multi-pass membrane protein
Mol. Mass.:68497.11
Organism:Homo sapiens (Human)
Description:Q01959
Residue:620
BDBM287946
NameBDBM287946
Synonyms:2-(4-(dimethylamino)phenyl)-N-(2- phenyl-2-(1H-pyrrol-2- yl)ethyl)quinazolin-4-amine | US10087148, Example 14
TypeSmall organic molecule
Emp. Form.C28H27N5
Mol. Mass.433.5475
SMILESCN(C)c1ccc(cc1)-c1nc(NCC(c2ccc[nH]2)c2ccccc2)c2ccccc2n1