Reaction Details
TargetSodium-dependent dopamine transporter
LigandBDBM287951
Substrate/Competitorn/a
Meas. Tech.Assay for Dopamine Reuptake Inhibition
pH7.4±n/a
EC50 43.0±13 nM
Commentsextracted
Citation Ananthan, SRothman, RB Quinazolines as biogenic amine transport modulators US Patent US10087148 Publication Date 10/2/2018
 
Sodium-dependent dopamine transporter
Name:Sodium-dependent dopamine transporter
Type:Multi-pass membrane protein
Mol. Mass.:68497.11
Organism:Homo sapiens (Human)
Description:Q01959
Residue:620
BDBM287951
NameBDBM287951
Synonyms:N-(4-(4-((2-morpholino-2- phenylethyl)amino)quinazolin-2- yl)phenyl)methanesulfonamide | US10087148, Example 19
TypeSmall organic molecule
Emp. Form.C27H29N5O3S
Mol. Mass.503.616
SMILESCS(=O)(=O)Nc1ccc(cc1)-c1nc(NCC(N2CCOCC2)c2ccccc2)c2ccccc2n1