Reaction Details
TargetSodium-dependent dopamine transporter
LigandBDBM287981
Substrate/Competitorn/a
Meas. Tech.Assay for Dopamine Reuptake Inhibition
pH7.4±n/a
EC50 42.0±10 nM
Commentsextracted
Citation Ananthan, SRothman, RB Quinazolines as biogenic amine transport modulators US Patent US10087148 Publication Date 10/2/2018
 
Sodium-dependent dopamine transporter
Name:Sodium-dependent dopamine transporter
Type:Multi-pass membrane protein
Mol. Mass.:68497.11
Organism:Homo sapiens (Human)
Description:Q01959
Residue:620
BDBM287981
NameBDBM287981
Synonyms:2-(4-(dimethylamino)phenyl)-N-(2- phenoxy-2-phenylethyl)quinazolin-4- amine | US10087148, Example 48
TypeSmall organic molecule
Emp. Form.C30H28N4O
Mol. Mass.460.5695
SMILESCN(C)c1ccc(cc1)-c1nc(NCC(Oc2ccccc2)c2ccccc2)c2ccccc2n1