Reaction Details
TargetPhosphatidylinositol 4,5-bisphosphate 3-kinase catalytic subunit delta isoform
LigandBDBM172459
Substrate/Competitorn/a
Meas. Tech.Inhibition Assay
pH7.5±n/a
IC50 0.106±n/a nM
Commentsextracted
Citation Heffron, TSafina, BStaben, SSutherlin, DPWei, BElliott, RHeald, RSeward, EMGancia, EWaszkowycz, B Benzoxazepin compounds selective for PI3K P110 delta and methods of use US Patent US9090628 Publication Date 7/28/2015
 
Phosphatidylinositol 4,5-bisphosphate 3-kinase catalytic subunit delta isoform
Name:Phosphatidylinositol 4,5-bisphosphate 3-kinase catalytic subunit delta isoform
Type:Enzyme Subunit
Mol. Mass.:119489.41
Organism:Homo sapiens (Human)
Description:O00329
Residue:1044
BDBM172459
NameBDBM172459
Synonyms:US9090628, 101 US9090628, 103 | US9090628, 104
TypeSmall organic molecule
Emp. Form.C25H31F3N8O
Mol. Mass.516.5618
SMILESCN1CCCCC1C1CCCN1c1cc2OCCn3cc(nc3-c2cn1)-c1nc(C)nn1CC(F)(F)F