Reaction Details
TargetPhosphatidylinositol 4,5-bisphosphate 3-kinase catalytic subunit delta isoform
LigandBDBM172706
Substrate/Competitorn/a
Meas. Tech.Inhibition Assay
pH7.5±n/a
IC50<0.035±n/a nM
Commentsextracted
Citation Heffron, TSafina, BStaben, SSutherlin, DPWei, BElliott, RHeald, RSeward, EMGancia, EWaszkowycz, B Benzoxazepin compounds selective for PI3K P110 delta and methods of use US Patent US9090628 Publication Date 7/28/2015
 
Phosphatidylinositol 4,5-bisphosphate 3-kinase catalytic subunit delta isoform
Name:Phosphatidylinositol 4,5-bisphosphate 3-kinase catalytic subunit delta isoform
Type:Enzyme Subunit
Mol. Mass.:119489.41
Organism:Homo sapiens (Human)
Description:O00329
Residue:1044
BDBM172706
NameBDBM172706
Synonyms:US9090628, 366
TypeSmall organic molecule
Emp. Form.C29H39N9O
Mol. Mass.529.6797
SMILESCC(C)N1CCN(C)C(C1)c1c(cnn1C)-c1ccc2-c3nc(cn3CCOc2c1)-c1nc(C)nn1C(C)C