Reaction Details
TargetPeptidyl-prolyl cis-trans isomerase A
LigandBDBM172718
Substrate/Competitorn/a
Meas. Tech.Inhibition Assay
IC50 9.7±n/a nM
Citation Gregory, MAMoss, SJWilkinson, B Compound and methods for its production US Patent US9090657 Publication Date 7/28/2015
 
Peptidyl-prolyl cis-trans isomerase A
Name:Peptidyl-prolyl cis-trans isomerase A
Type:Protein
Mol. Mass.:18015.32
Organism:Homo sapiens (Human)
Description:P62937
Residue:165
BDBM172718
NameBDBM172718
Synonyms:US11802108, Compound CSA | US9090657, Cyclosporine A, 1
TypeSmall organic molecule
Emp. Form.C62H111N11O12
Mol. Mass.1202.6112
SMILESCCC1NC(=O)C(C(O)C(C)C\C=C\C)N(C)C(=O)C(C(C)C)N(C)C(=O)C(CC(C)C)N(C)C(=O)C(CC(C)C)N(C)C(=O)C(C)NC(=O)C(C)NC(=O)C(CC(C)C)N(C)C(=O)C(NC(=O)C(CC(C)C)N(C)C(=O)CN(C)C1=O)C(C)C