Reaction Details
TargetSolute carrier organic anion transporter family member 1B3
LigandBDBM172717
Substrate/Competitorn/a
Meas. Tech.In Vitro Uptake Transporter Assay
pH7.3±n/a
Temperature310.15±n/a K
IC50 1800±n/a nM
Commentsextracted
Citation Gregory, MAMoss, SJWilkinson, B Compound and methods for its production US Patent US9090657 Publication Date 7/28/2015
 
Solute carrier organic anion transporter family member 1B3
Name:Solute carrier organic anion transporter family member 1B3
Type:Protein
Mol. Mass.:77425.75
Organism:Homo sapiens (Human)
Description:Q9NPD5
Residue:702
BDBM172717
NameBDBM172717
Synonyms:US9090657, 24
TypeSmall organic molecule
Emp. Form.C45H62FN5O11
Mol. Mass.867.9991
SMILESCC(C)[C@@H]1NC(=O)[C@H](CCC(C)=O)[C@H](O)[C@@H](C)[C@@H](O)\C=C\C=C\C[C@H](OC(=O)C2CCCN(N2)C(=O)[C@H](Cc2cc(O)cc(F)c2)NC1=O)C(\C)=C\C=C\C(=O)N1CCCCO1