Reaction Details
TargetBeta-secretase 2
LigandBDBM172740
Substrate/Competitorn/a
Meas. Tech.Inhibition Assay
Ki 0.0014±n/a nM
Citation Tang, JHuang, XDowns, DGhosh, AK Inhibition of memapsin 1 cleavage in the treatment of diabetes US Patent US9096541 Publication Date 8/4/2015
 
Beta-secretase 2
Name:Beta-secretase 2
Type:Protein
Mol. Mass.:56171.20
Organism:Homo sapiens (Human)
Description:Q9Y5Z0
Residue:518
BDBM172740
NameBDBM172740
Synonyms:US9096541, 113
TypeSmall organic molecule
Emp. Form.C38H52N4O5
Mol. Mass.644.8433
SMILESCCCC(O)C(NCC(O)C(Cc1ccccc1)NC(=O)c1cc(C)cc(c1)C(=O)N(C)C(C)c1ccccc1)C(=O)NCC(C)C