Reaction Details
TargetBeta-secretase 2
LigandBDBM172750
Substrate/Competitorn/a
Meas. Tech.Inhibition Assay
Ki 0.02±n/a nM
Citation Tang, JHuang, XDowns, DGhosh, AK Inhibition of memapsin 1 cleavage in the treatment of diabetes US Patent US9096541 Publication Date 8/4/2015
 
Beta-secretase 2
Name:Beta-secretase 2
Type:Protein
Mol. Mass.:56171.20
Organism:Homo sapiens (Human)
Description:Q9Y5Z0
Residue:518
BDBM172750
NameBDBM172750
Synonyms:US9096541, 6412
TypeSmall organic molecule
Emp. Form.C37H50N4O5
Mol. Mass.630.8167
SMILESCCCC(O)C(NCC(O)C(Cc1ccccc1)NC(=O)c1cccc(c1)C(=O)N(C)C(C)c1ccccc1)C(=O)NCC(C)C