Reaction Details
TargetTyrosine-protein kinase SYK
LigandBDBM173001
Substrate/Competitorn/a
Meas. Tech.In Vitro Kinase Assay
IC50 1.2±n/a nM
Citation Dahmann, GDollinger, HGnamm, CFiegen, DHoffmann, MKlicic, JLamb, DJSchnapp, A Amino-indolyl-substituted imidazolyl-pyrimidines and their use as medicaments US Patent US9096579 Publication Date 8/4/2015
 
Tyrosine-protein kinase SYK
Name:Tyrosine-protein kinase SYK
Type:Enzyme
Mol. Mass.:72079.99
Organism:Homo sapiens (Human)
Description:P43405
Residue:635
BDBM173001
NameBDBM173001
Synonyms:US9096579, 103
TypeSmall organic molecule
Emp. Form.C24H25N9O
Mol. Mass.455.515
SMILESCc1cc(CNC(=O)c2cc3cc(Nc4nccc(n4)-c4cn(C)cn4)cc(C)c3[nH]2)n(C)n1