Reaction Details
TargetTyrosine-protein kinase SYK
LigandBDBM173071
Substrate/Competitorn/a
Meas. Tech.In Vitro Kinase Assay
IC50 1.4±n/a nM
Citation Dahmann, GDollinger, HGnamm, CFiegen, DHoffmann, MKlicic, JLamb, DJSchnapp, A Amino-indolyl-substituted imidazolyl-pyrimidines and their use as medicaments US Patent US9096579 Publication Date 8/4/2015
 
Tyrosine-protein kinase SYK
Name:Tyrosine-protein kinase SYK
Type:Enzyme
Mol. Mass.:72079.99
Organism:Homo sapiens (Human)
Description:P43405
Residue:635
BDBM173071
NameBDBM173071
Synonyms:US9096579, 173
TypeSmall organic molecule
Emp. Form.C20H18N8O
Mol. Mass.386.4099
SMILESCc1nnc(o1)-c1cc2cc(Nc3nccc(n3)-c3cn(C)cn3)cc(C)c2[nH]1