Reaction Details
TargetTyrosine-protein kinase SYK
LigandBDBM173005
Substrate/Competitorn/a
Meas. Tech.In Vitro Kinase Assay
IC50 3.4±n/a nM
Citation Dahmann, GDollinger, HGnamm, CFiegen, DHoffmann, MKlicic, JLamb, DJSchnapp, A Amino-indolyl-substituted imidazolyl-pyrimidines and their use as medicaments US Patent US9096579 Publication Date 8/4/2015
 
Tyrosine-protein kinase SYK
Name:Tyrosine-protein kinase SYK
Type:Enzyme
Mol. Mass.:72079.99
Organism:Homo sapiens (Human)
Description:P43405
Residue:635
BDBM173005
NameBDBM173005
Synonyms:US9096579, 107
TypeSmall organic molecule
Emp. Form.C23H22N8OS
Mol. Mass.458.539
SMILESCc1cnc(CNC(=O)c2cc3cc(Nc4nccc(n4)-c4cn(C)cn4)cc(C)c3[nH]2)s1