Reaction Details
TargetcAMP and cAMP-inhibited cGMP 3',5'-cyclic phosphodiesterase 10A
LigandBDBM60522
Substrate/Competitorn/a
Meas. Tech.Inhibition Assay
Temperature298.15±n/a K
IC50 12±n/a nM
Commentsextracted
Citation Püschl, ANielsen, JKehler, JKilburn, JPMarigo, MLanggård, M Heteroaromatic phenylimidazole derivatives as PDE10A enzyme inhibitors US Patent US9096589 Publication Date 8/4/2015
 
cAMP and cAMP-inhibited cGMP 3',5'-cyclic phosphodiesterase 10A
Name:cAMP and cAMP-inhibited cGMP 3',5'-cyclic phosphodiesterase 10A
Type:Protein
Mol. Mass.:88412.52
Organism:Homo sapiens (Human)
Description:Q9Y233
Residue:1055
BDBM60522
NameBDBM60522
Synonyms:US9096589, 5,8-Dimethyl-2-[2-(1-methyl-4-thiazol-2-yl-1H-imidazol-2-yl)-ethyl]-[1,2,4]triazolo[1,5-c]pyrimidine
Typen/a
Emp. Form.C16H17N7S
Mol. Mass.339.418
SMILESCc1cnc(C)n2nc(CCc3nc(cn3C)-c3nccs3)nc12