Reaction Details
TargetcAMP and cAMP-inhibited cGMP 3',5'-cyclic phosphodiesterase 10A
LigandBDBM173082
Substrate/Competitorn/a
Meas. Tech.Inhibition Assay
Temperature298.15±n/a K
IC50 220±n/a nM
Commentsextracted
Citation Püschl, ANielsen, JKehler, JKilburn, JPMarigo, MLanggård, M Heteroaromatic phenylimidazole derivatives as PDE10A enzyme inhibitors US Patent US9096589 Publication Date 8/4/2015
 
cAMP and cAMP-inhibited cGMP 3',5'-cyclic phosphodiesterase 10A
Name:cAMP and cAMP-inhibited cGMP 3',5'-cyclic phosphodiesterase 10A
Type:Protein
Mol. Mass.:88412.52
Organism:Homo sapiens (Human)
Description:Q9Y233
Residue:1055
BDBM173082
NameBDBM173082
Synonyms:US9096589, 5,7-Dimethyl-2-[(E)-2-(1-methyl-4-pyridin-3-yl-1H-imidazol-2-yl)-vinyl]-imidazo[1,2-a]pyrimidine
TypeSmall organic molecule
Emp. Form.C19H18N6
Mol. Mass.330.3864
SMILESCc1cc(C)n2cc(\C=C\c3nc(cn3C)-c3cccnc3)nc2n1