Reaction Details
TargetcAMP and cAMP-inhibited cGMP 3',5'-cyclic phosphodiesterase 10A
LigandBDBM173089
Substrate/Competitorn/a
Meas. Tech.Inhibition Assay
Temperature298.15±n/a K
IC50 56±n/a nM
Commentsextracted
Citation Püschl, ANielsen, JKehler, JKilburn, JPMarigo, MLanggård, M Heteroaromatic phenylimidazole derivatives as PDE10A enzyme inhibitors US Patent US9096589 Publication Date 8/4/2015
 
cAMP and cAMP-inhibited cGMP 3',5'-cyclic phosphodiesterase 10A
Name:cAMP and cAMP-inhibited cGMP 3',5'-cyclic phosphodiesterase 10A
Type:Protein
Mol. Mass.:88412.52
Organism:Homo sapiens (Human)
Description:Q9Y233
Residue:1055
BDBM173089
NameBDBM173089
Synonyms:US9096589, 5,7-Dimethyl-2-[(E)-2-(1-methyl-4-thiophen-3-yl-1H-imidazol-2-yl)-vinyl]-imidazo[1,2-a]pyrimidine | US9669029, 10 5,7-Dimethyl-2-[(E)-2-(1-methyl-4-thiophen-3-yl-1H-imidazol-2-yl)-vinyl]-imidazo[1,2-a]pyrimidine
TypeSmall organic molecule
Emp. Form.C18H17N5S
Mol. Mass.335.426
SMILESCc1cc(C)n2cc(\C=C\c3nc(cn3C)-c3ccsc3)nc2n1