Reaction Details
TargetcAMP and cAMP-inhibited cGMP 3',5'-cyclic phosphodiesterase 10A
LigandBDBM173094
Substrate/Competitorn/a
Meas. Tech.Inhibition Assay
Temperature298.15±n/a K
IC50 81±n/a nM
Commentsextracted
Citation Püschl, ANielsen, JKehler, JKilburn, JPMarigo, MLanggård, M Heteroaromatic phenylimidazole derivatives as PDE10A enzyme inhibitors US Patent US9096589 Publication Date 8/4/2015
 
cAMP and cAMP-inhibited cGMP 3',5'-cyclic phosphodiesterase 10A
Name:cAMP and cAMP-inhibited cGMP 3',5'-cyclic phosphodiesterase 10A
Type:Protein
Mol. Mass.:88412.52
Organism:Homo sapiens (Human)
Description:Q9Y233
Residue:1055
BDBM173094
NameBDBM173094
Synonyms:US9096589, 5,7-Dimethyl-2-{(E)-2-[4-thiophen-2-yl-1-(2-trimethylsilanyl-ethoxymethyl)-1H-imidazol-2-yl]-vinyl}-imidazo[1,2-a]pyrimidine
TypeSmall organic molecule
Emp. Form.C23H29N5OSSi
Mol. Mass.451.66
SMILESCc1cc(C)n2cc(\C=C\c3nc(cn3COCC[Si](C)(C)C)-c3cccs3)nc2n1