Reaction Details
TargetcAMP and cAMP-inhibited cGMP 3',5'-cyclic phosphodiesterase 10A
LigandBDBM173098
Substrate/Competitorn/a
Meas. Tech.Inhibition Assay
Temperature298.15±n/a K
IC50 36±n/a nM
Commentsextracted
Citation Püschl, ANielsen, JKehler, JKilburn, JPMarigo, MLanggård, M Heteroaromatic phenylimidazole derivatives as PDE10A enzyme inhibitors US Patent US9096589 Publication Date 8/4/2015
 
cAMP and cAMP-inhibited cGMP 3',5'-cyclic phosphodiesterase 10A
Name:cAMP and cAMP-inhibited cGMP 3',5'-cyclic phosphodiesterase 10A
Type:Protein
Mol. Mass.:88412.52
Organism:Homo sapiens (Human)
Description:Q9Y233
Residue:1055
BDBM173098
NameBDBM173098
Synonyms:US9096589, 5,7-Dimethyl-2-{2-[1-(2-morpholin-4-yl-ethyl)-4-thiophen-2-yl-1H-imidazol-2-yl]-ethyl}-imidazo[1,2-a]pyrimidine | US9669029, 19 5,7-Dimethyl-2-{2-[1-(2-morpholin-4-yl-ethyl)-4-thiophen-2-yl-1H-imidazol-2-yl]-ethyl}-imidazo[1,2-a]pyrimidine
TypeSmall organic molecule
Emp. Form.C23H28N6OS
Mol. Mass.436.573
SMILESCc1cc(C)n2cc(CCc3nc(cn3CCN3CCOCC3)-c3cccs3)nc2n1