Reaction Details
TargetcAMP and cAMP-inhibited cGMP 3',5'-cyclic phosphodiesterase 10A
LigandBDBM173101
Substrate/Competitorn/a
Meas. Tech.Inhibition Assay
Temperature298.15±n/a K
IC50 7.9±n/a nM
Commentsextracted
Citation Püschl, ANielsen, JKehler, JKilburn, JPMarigo, MLanggård, M Heteroaromatic phenylimidazole derivatives as PDE10A enzyme inhibitors US Patent US9096589 Publication Date 8/4/2015
 
cAMP and cAMP-inhibited cGMP 3',5'-cyclic phosphodiesterase 10A
Name:cAMP and cAMP-inhibited cGMP 3',5'-cyclic phosphodiesterase 10A
Type:Protein
Mol. Mass.:88412.52
Organism:Homo sapiens (Human)
Description:Q9Y233
Residue:1055
BDBM173101
NameBDBM173101
Synonyms:US9096589, 1-{2-[2-(5,7-Dimethyl-imidazo[1,2-a]pyrimidin-2-yl)-ethyl]-4-thiophen-2-yl-imidazol-1-yl}-3-methoxy-propan-2-ol
TypeSmall organic molecule
Emp. Form.C21H25N5O2S
Mol. Mass.411.521
SMILESCOCC(O)Cn1cc(nc1CCc1cn2c(C)cc(C)nc2n1)-c1cccs1