Reaction Details
TargetcAMP and cAMP-inhibited cGMP 3',5'-cyclic phosphodiesterase 10A
LigandBDBM173103
Substrate/Competitorn/a
Meas. Tech.Inhibition Assay
Temperature298.15±n/a K
IC50 160±n/a nM
Commentsextracted
Citation Püschl, ANielsen, JKehler, JKilburn, JPMarigo, MLanggård, M Heteroaromatic phenylimidazole derivatives as PDE10A enzyme inhibitors US Patent US9096589 Publication Date 8/4/2015
 
cAMP and cAMP-inhibited cGMP 3',5'-cyclic phosphodiesterase 10A
Name:cAMP and cAMP-inhibited cGMP 3',5'-cyclic phosphodiesterase 10A
Type:Protein
Mol. Mass.:88412.52
Organism:Homo sapiens (Human)
Description:Q9Y233
Residue:1055
BDBM173103
NameBDBM173103
Synonyms:US9096589, 2-[2-(1-Isopropyl-4-thiophen-2-yl-1H-imidazol-2-yl)-ethyl]-5,7-dimethyl-imidazo[1,2-a]pyrimidine | US9669029, 24 2-[2-(1-Isopropyl-4-thiophen-2-yl-1H-imidazol-2-yl)-ethyl]-5,7-dimethyl-imidazo[1,2-a]pyrimidine
TypeSmall organic molecule
Emp. Form.C20H23N5S
Mol. Mass.365.495
SMILESCC(C)n1cc(nc1CCc1cn2c(C)cc(C)nc2n1)-c1cccs1