Reaction Details
TargetcAMP and cAMP-inhibited cGMP 3',5'-cyclic phosphodiesterase 10A
LigandBDBM173105
Substrate/Competitorn/a
Meas. Tech.Inhibition Assay
Temperature298.15±n/a K
IC50 6.8±n/a nM
Commentsextracted
Citation Püschl, ANielsen, JKehler, JKilburn, JPMarigo, MLanggård, M Heteroaromatic phenylimidazole derivatives as PDE10A enzyme inhibitors US Patent US9096589 Publication Date 8/4/2015
 
cAMP and cAMP-inhibited cGMP 3',5'-cyclic phosphodiesterase 10A
Name:cAMP and cAMP-inhibited cGMP 3',5'-cyclic phosphodiesterase 10A
Type:Protein
Mol. Mass.:88412.52
Organism:Homo sapiens (Human)
Description:Q9Y233
Residue:1055
BDBM173105
NameBDBM173105
Synonyms:US9096589, 5,7-Dimethyl-2-{2-[1-(3-methyl-butyl)-4-thiophen-2-yl-1H-imidazol-2-yl]-ethyl}-imidazo[1,2-a]pyrimidine | US9669029, 26 5,7-Dimethyl-2-{2-[1-(3-methyl-butyl)-4-thiophen-2-yl-1H-imidazol-2-yl]-ethyl}-imidazo[1,2-a]pyrimidine
TypeSmall organic molecule
Emp. Form.C22H27N5S
Mol. Mass.393.548
SMILESCC(C)CCn1cc(nc1CCc1cn2c(C)cc(C)nc2n1)-c1cccs1