Reaction Details
TargetcAMP and cAMP-inhibited cGMP 3',5'-cyclic phosphodiesterase 10A
LigandBDBM173106
Substrate/Competitorn/a
Meas. Tech.Inhibition Assay
Temperature298.15±n/a K
IC50 12±n/a nM
Commentsextracted
Citation Püschl, ANielsen, JKehler, JKilburn, JPMarigo, MLanggård, M Heteroaromatic phenylimidazole derivatives as PDE10A enzyme inhibitors US Patent US9096589 Publication Date 8/4/2015
 
cAMP and cAMP-inhibited cGMP 3',5'-cyclic phosphodiesterase 10A
Name:cAMP and cAMP-inhibited cGMP 3',5'-cyclic phosphodiesterase 10A
Type:Protein
Mol. Mass.:88412.52
Organism:Homo sapiens (Human)
Description:Q9Y233
Residue:1055
BDBM173106
NameBDBM173106
Synonyms:US9096589, 2-[2-(1-Isobutyl-4-thiophen-2-yl-1H-imidazol-2-yl)-ethyl]-5,7-dimethyl-imidazo[1,2-a]pyrimidine
TypeSmall organic molecule
Emp. Form.C21H25N5S
Mol. Mass.379.522
SMILESCC(C)Cn1cc(nc1CCc1cn2c(C)cc(C)nc2n1)-c1cccs1