Reaction Details
TargetcAMP and cAMP-inhibited cGMP 3',5'-cyclic phosphodiesterase 10A
LigandBDBM173110
Substrate/Competitorn/a
Meas. Tech.Inhibition Assay
Temperature298.15±n/a K
IC50 58±n/a nM
Commentsextracted
Citation Püschl, ANielsen, JKehler, JKilburn, JPMarigo, MLanggård, M Heteroaromatic phenylimidazole derivatives as PDE10A enzyme inhibitors US Patent US9096589 Publication Date 8/4/2015
 
cAMP and cAMP-inhibited cGMP 3',5'-cyclic phosphodiesterase 10A
Name:cAMP and cAMP-inhibited cGMP 3',5'-cyclic phosphodiesterase 10A
Type:Protein
Mol. Mass.:88412.52
Organism:Homo sapiens (Human)
Description:Q9Y233
Residue:1055
BDBM173110
NameBDBM173110
Synonyms:US9096589, 1-{2-[2-(5,7-Dimethyl-imidazo[1,2-a]pyrimidin-2-yl)-ethyl]-4-thiazol-5-yl-imidazol-1-yl}-3-methoxy-propan-2-ol | US9669029, 31 1-{2-[2-(5,7-Dimethyl-imidazo[1,2-a]pyrimidin-2-yl)-ethyl]-4-thiazol-5-yl-imidazol-1-yl}-3-methoxy-propan-2-ol
TypeSmall organic molecule
Emp. Form.C20H24N6O2S
Mol. Mass.412.509
SMILESCOCC(O)Cn1cc(nc1CCc1cn2c(C)cc(C)nc2n1)-c1cncs1