Reaction Details
TargetcAMP and cAMP-inhibited cGMP 3',5'-cyclic phosphodiesterase 10A
LigandBDBM173114
Substrate/Competitorn/a
Meas. Tech.Inhibition Assay
Temperature298.15±n/a K
IC50 6.4±n/a nM
Commentsextracted
Citation Püschl, ANielsen, JKehler, JKilburn, JPMarigo, MLanggård, M Heteroaromatic phenylimidazole derivatives as PDE10A enzyme inhibitors US Patent US9096589 Publication Date 8/4/2015
 
cAMP and cAMP-inhibited cGMP 3',5'-cyclic phosphodiesterase 10A
Name:cAMP and cAMP-inhibited cGMP 3',5'-cyclic phosphodiesterase 10A
Type:Protein
Mol. Mass.:88412.52
Organism:Homo sapiens (Human)
Description:Q9Y233
Residue:1055
BDBM173114
NameBDBM173114
Synonyms:US9096589, (S)-2-{2-[2-(5-Methyl-[1,2,4]triazolo[1,5-a]pyridin-2-yl)-ethyl]-4-thiophen-2-yl-imidazol-1-yl}-propan-1-ol
TypeSmall organic molecule
Emp. Form.C19H21N5OS
Mol. Mass.367.468
SMILESC[C@@H](CO)n1cc(nc1CCc1nc2cccc(C)n2n1)-c1cccs1