Reaction Details
TargetcAMP and cAMP-inhibited cGMP 3',5'-cyclic phosphodiesterase 10A
LigandBDBM173116
Substrate/Competitorn/a
Meas. Tech.Inhibition Assay
Temperature298.15±n/a K
IC50 210±n/a nM
Commentsextracted
Citation Püschl, ANielsen, JKehler, JKilburn, JPMarigo, MLanggård, M Heteroaromatic phenylimidazole derivatives as PDE10A enzyme inhibitors US Patent US9096589 Publication Date 8/4/2015
 
cAMP and cAMP-inhibited cGMP 3',5'-cyclic phosphodiesterase 10A
Name:cAMP and cAMP-inhibited cGMP 3',5'-cyclic phosphodiesterase 10A
Type:Protein
Mol. Mass.:88412.52
Organism:Homo sapiens (Human)
Description:Q9Y233
Residue:1055
BDBM173116
NameBDBM173116
Synonyms:US9096589, 5-Methyl-2-{(E)-2-[4-(5-methyl-thiophen-2-yl)-1-(2-trimethylsilanyl-ethoxymethyl)-1H-imidazol-2-yl]-vinyl}-[1,2,4]triazolo[1,5-a]pyridine
TypeSmall organic molecule
Emp. Form.C23H29N5OSSi
Mol. Mass.451.66
SMILESCc1ccc(s1)-c1cn(COCC[Si](C)(C)C)c(\C=C\c2nc3cccc(C)n3n2)n1