Reaction Details
TargetcAMP and cAMP-inhibited cGMP 3',5'-cyclic phosphodiesterase 10A
LigandBDBM173127
Substrate/Competitorn/a
Meas. Tech.Inhibition Assay
Temperature298.15±n/a K
IC50 47±n/a nM
Commentsextracted
Citation Püschl, ANielsen, JKehler, JKilburn, JPMarigo, MLanggård, M Heteroaromatic phenylimidazole derivatives as PDE10A enzyme inhibitors US Patent US9096589 Publication Date 8/4/2015
 
cAMP and cAMP-inhibited cGMP 3',5'-cyclic phosphodiesterase 10A
Name:cAMP and cAMP-inhibited cGMP 3',5'-cyclic phosphodiesterase 10A
Type:Protein
Mol. Mass.:88412.52
Organism:Homo sapiens (Human)
Description:Q9Y233
Residue:1055
BDBM173127
NameBDBM173127
Synonyms:US9096589, 2-[(E)-2-(4-Furan-3-yl-1-methyl-1H-imidazol-2-yl)-vinyl]-8-methoxy-[1,2,4]triazolo[1,5-a]pyridine
TypeSmall organic molecule
Emp. Form.C17H15N5O2
Mol. Mass.321.3333
SMILESCOc1cccn2nc(\C=C\c3nc(cn3C)-c3ccoc3)nc12