Reaction Details
TargetcAMP and cAMP-inhibited cGMP 3',5'-cyclic phosphodiesterase 10A
LigandBDBM173141
Substrate/Competitorn/a
Meas. Tech.Inhibition Assay
Temperature298.15±n/a K
IC50 47±n/a nM
Commentsextracted
Citation Püschl, ANielsen, JKehler, JKilburn, JPMarigo, MLanggård, M Heteroaromatic phenylimidazole derivatives as PDE10A enzyme inhibitors US Patent US9096589 Publication Date 8/4/2015
 
cAMP and cAMP-inhibited cGMP 3',5'-cyclic phosphodiesterase 10A
Name:cAMP and cAMP-inhibited cGMP 3',5'-cyclic phosphodiesterase 10A
Type:Protein
Mol. Mass.:88412.52
Organism:Homo sapiens (Human)
Description:Q9Y233
Residue:1055
BDBM173141
NameBDBM173141
Synonyms:US9096589, 8-Fluoro-2-[2-(1-methyl-4-thiophen-2-yl-1H-imidazol-2-yl)-ethyl]-[1,2,4]triazolo[1,5-a]pyridine
TypeSmall organic molecule
Emp. Form.C16H14FN5S
Mol. Mass.327.379
SMILESCn1cc(nc1CCc1nc2c(F)cccn2n1)-c1cccs1