Reaction Details
TargetcAMP and cAMP-inhibited cGMP 3',5'-cyclic phosphodiesterase 10A
LigandBDBM173142
Substrate/Competitorn/a
Meas. Tech.Inhibition Assay
Temperature298.15±n/a K
IC50 94±n/a nM
Commentsextracted
Citation Püschl, ANielsen, JKehler, JKilburn, JPMarigo, MLanggård, M Heteroaromatic phenylimidazole derivatives as PDE10A enzyme inhibitors US Patent US9096589 Publication Date 8/4/2015
 
cAMP and cAMP-inhibited cGMP 3',5'-cyclic phosphodiesterase 10A
Name:cAMP and cAMP-inhibited cGMP 3',5'-cyclic phosphodiesterase 10A
Type:Protein
Mol. Mass.:88412.52
Organism:Homo sapiens (Human)
Description:Q9Y233
Residue:1055
BDBM173142
NameBDBM173142
Synonyms:US9096589, 8-Fluoro-2-{2-[1-methyl-4-(5-methyl-furan-2-yl)-1H-imidazol-2-yl]-ethyl}-[1,2,4]triazolo[1,5-a]pyridine
TypeSmall organic molecule
Emp. Form.C17H16FN5O
Mol. Mass.325.3402
SMILESCc1ccc(o1)-c1cn(C)c(CCc2nc3c(F)cccn3n2)n1