Reaction Details
TargetcAMP and cAMP-inhibited cGMP 3',5'-cyclic phosphodiesterase 10A
LigandBDBM173172
Substrate/Competitorn/a
Meas. Tech.Inhibition Assay
Temperature298.15±n/a K
IC50 1.2±n/a nM
Commentsextracted
Citation Püschl, ANielsen, JKehler, JKilburn, JPMarigo, MLanggård, M Heteroaromatic phenylimidazole derivatives as PDE10A enzyme inhibitors US Patent US9096589 Publication Date 8/4/2015
 
cAMP and cAMP-inhibited cGMP 3',5'-cyclic phosphodiesterase 10A
Name:cAMP and cAMP-inhibited cGMP 3',5'-cyclic phosphodiesterase 10A
Type:Protein
Mol. Mass.:88412.52
Organism:Homo sapiens (Human)
Description:Q9Y233
Residue:1055
BDBM173172
NameBDBM173172
Synonyms:US9096589, 8-Methoxy-5-methyl-2-[2-(1-propyl-4-thiophen-2-yl-1H-imidazol-2-yl)-ethyl]-[1,2,4]triazolo[1,5-a]pyridine
TypeSmall organic molecule
Emp. Form.C20H23N5OS
Mol. Mass.381.495
SMILESCCCn1cc(nc1CCc1nc2c(OC)ccc(C)n2n1)-c1cccs1