Reaction Details
TargetcAMP and cAMP-inhibited cGMP 3',5'-cyclic phosphodiesterase 10A
LigandBDBM173182
Substrate/Competitorn/a
Meas. Tech.Inhibition Assay
Temperature298.15±n/a K
IC50 3.1±n/a nM
Commentsextracted
Citation Püschl, ANielsen, JKehler, JKilburn, JPMarigo, MLanggård, M Heteroaromatic phenylimidazole derivatives as PDE10A enzyme inhibitors US Patent US9096589 Publication Date 8/4/2015
 
cAMP and cAMP-inhibited cGMP 3',5'-cyclic phosphodiesterase 10A
Name:cAMP and cAMP-inhibited cGMP 3',5'-cyclic phosphodiesterase 10A
Type:Protein
Mol. Mass.:88412.52
Organism:Homo sapiens (Human)
Description:Q9Y233
Residue:1055
BDBM173182
NameBDBM173182
Synonyms:US9096589, 8-Methoxy-5-methyl-2-{2-[1-methyl-4-(4-methyl-thiophen-3-yl)-1H-imidazol-2-yl]-ethyl}-[1,2,4]triazolo[1,5-a]pyridine
TypeSmall organic molecule
Emp. Form.C19H21N5OS
Mol. Mass.367.468
SMILESCOc1ccc(C)n2nc(CCc3nc(cn3C)-c3cscc3C)nc12