Reaction Details
TargetProstaglandin D2 receptor 2
LigandBDBM173207
Substrate/Competitorn/a
Meas. Tech.Radioligand Displacement Assay
pH7±n/a
Temperature298.15±n/a K
IC50 0.7±n/a nM
Commentsextracted
Citation Aissaoui, HBoss, CGabillet, JRichard-Bildstein, SSiegrist, R 7-(heteroaryl-amino)-6,7,8,9-tetrahydropyrido[1,2-a]indol acetic acid derivatives and their use as prostaglandin D2 receptor modulators US Patent US9096595 Publication Date 8/4/2015
 
Prostaglandin D2 receptor 2
Name:Prostaglandin D2 receptor 2
Type:Enzyme
Mol. Mass.:43295.45
Organism:Homo sapiens (Human)
Description:Q9Y5Y4
Residue:395
BDBM173207
NameBDBM173207
Synonyms:US9096595, 10
TypeSmall organic molecule
Emp. Form.C22H19F2N3O3
Mol. Mass.411.4014
SMILESCN(C1CCc2c(CC(O)=O)c3ccc(F)cc3n2C1)c1nc2cc(F)ccc2o1