Reaction Details
TargetProstaglandin D2 receptor 2
LigandBDBM173244
Substrate/Competitorn/a
Meas. Tech.Radioligand Displacement Assay
pH7±n/a
Temperature298.15±n/a K
IC50 0.8±n/a nM
Commentsextracted
Citation Aissaoui, HBoss, CGabillet, JRichard-Bildstein, SSiegrist, R 7-(heteroaryl-amino)-6,7,8,9-tetrahydropyrido[1,2-a]indol acetic acid derivatives and their use as prostaglandin D2 receptor modulators US Patent US9096595 Publication Date 8/4/2015
 
Prostaglandin D2 receptor 2
Name:Prostaglandin D2 receptor 2
Type:Enzyme
Mol. Mass.:43295.45
Organism:Homo sapiens (Human)
Description:Q9Y5Y4
Residue:395
BDBM173244
NameBDBM173244
Synonyms:US9096595, 47
TypeSmall organic molecule
Emp. Form.C21H22ClFN4O3
Mol. Mass.432.876
SMILESCOCCN(C1CCc2c(CC(O)=O)c3ccc(Cl)cc3n2C1)c1ncc(F)cn1