Reaction Details
TargetP2X purinoceptor 7
LigandBDBM173271
Substrate/Competitorn/a
Meas. Tech.FLIPR Assay
pH7.4±n/a
IC50 4.5±n/a nM
Commentsextracted
Citation Alcazar Vaca, MJAndres Gil, JILetavic, MARudolph, DAShireman, BTStenne, BMZiff, JM P2X7 modulators US Patent US9096596 Publication Date 8/4/2015
 
P2X purinoceptor 7
Name:P2X purinoceptor 7
Type:Protein
Mol. Mass.:68602.85
Organism:Homo sapiens (Human)
Description:Q99572
Residue:595
BDBM173271
NameBDBM173271
Synonyms:US10323032, Example 107 US9096596, 23 | US9604982, Example 107
TypeSmall organic molecule
Emp. Form.C16H12Cl2N6O
Mol. Mass.375.212
SMILESClc1cccc(C(=O)N2CCc3c(C2)ncnc3-n2nccn2)c1Cl