Reaction Details
TargetRho-associated protein kinase 1/2
LigandBDBM148415
Substrate/Competitorn/a
Meas. Tech.MLC Phosphorylation Assay
EC50 550±n/a nM
Citation Boland, SBourin, ADefert, OLeysen, D Pyridine derivatives as soft rock inhibitors US Patent US9682963 Publication Date 6/20/2017
 
Rho-associated protein kinase 1/2
Name:Rho-associated protein kinase 1/2
Synonyms:ROCK Complex
Type:Protein
Mol. Mass.:n/a
Description:n/a
Components:This complex has 2 components.
Component 1
Name:Rho-associated protein kinase 1
Type:Protein
Mol. Mass.:159610.34
Organism:Rattus norvegicus (Rat)
Description:Q63644
Residue:1369
Component 2
Name:Rho-associated protein kinase 2
Synonyms:ROCK2_RAT Rho-associated protein kinase 2 Rho-associated, coiled-coil-containing protein kinase 2 RhoA-binding kinase 2 p150 ROK-alpha
Type:Protein
Mol. Mass.:160370.90
Organism:Rattus norvegicus (Rat)
Description:Q62868
Residue:1388
BDBM148415
NameBDBM148415
Synonyms:US9682963, 8
TypeSmall organic molecule
Emp. Form.C30H25FN4O4S
Mol. Mass.556.607
SMILESNCc1ccc(cc1-c1cccc(c1)C(=O)Nc1cccc(SC2CCOC2=O)c1)C(=O)Nc1ccncc1F