Reaction Details
TargetDisintegrin and metalloproteinase domain-containing protein 9
LigandBDBM175076
Substrate/Competitorn/a
Meas. Tech.Enzyme Assay
IC50 3251±n/a nM
Citation Chambon, SClary, LSchuppli, M N-[2-hydroxycarbamoyl-2-(piperazinyl) ethyl] benzamide compounds, their preparation and their use as TACE inhibitors US Patent US9115102 Publication Date 8/25/2015
 
Disintegrin and metalloproteinase domain-containing protein 9
Name:Disintegrin and metalloproteinase domain-containing protein 9
Type:Enzyme
Mol. Mass.:90567.68
Organism:Homo sapiens (Human)
Description:Q13443
Residue:819
BDBM175076
NameBDBM175076
Synonyms:US9115102, Ex2
TypeSmall organic molecule
Emp. Form.C19H26N4O6S
Mol. Mass.438.498
SMILESCC#CCOc1ccc(cc1)C(=O)NC[C@H](N1CCN(CC1)S(C)(=O)=O)C(=O)NO