Reaction Details
TargetHistone deacetylase 2
LigandBDBM19149
Substrate/Competitorn/a
Meas. Tech.Fluorescent Activity Assay
Temperature298.15±n/a K
IC50 100.9±10 nM
Commentsextracted
Citation Lin, JChen, CFang, JChen, JChern, TWei, T Dual action inhibitors against histone deacetylases and 3-hydroxy-3-methylglutaryl coenzyme a reductase US Patent US9115116 Publication Date 8/25/2015
 
Histone deacetylase 2
Name:Histone deacetylase 2
Type:Chromatin regulator; hydrolase; repressor
Mol. Mass.:55356.54
Organism:Homo sapiens (Human)
Description:Q92769
Residue:488
BDBM19149
NameBDBM19149
Synonyms:CHEMBL98 SAHA US10188756, Compound SAHA US11505523, Compound SAHA US9353061, SAHA US9695181, Vorinostat Zolinza suberoylanilide hydroxamic acid
TypeSmall organic molecule
Emp. Form.C14H20N2O3
Mol. Mass.264.3202
SMILESONC(=O)CCCCCCC(=O)Nc1ccccc1