Reaction Details
TargetCannabinoid receptor 2
LigandBDBM176632
Substrate/Competitorn/a
Meas. Tech.Binding Assay
IC50 21±n/a nM
Citation Arnaud, JArtiaga, MBarth, FHortala, LMartinez, SRoux, P 1,3,5-triazine-2-amine derivatives, preparation thereof and diagnostic and therapeutic use thereof US Patent US9115121 Publication Date 8/25/2015
 
Cannabinoid receptor 2
Name:Cannabinoid receptor 2
Type:G Protein-Coupled Receptor (GPCR)
Mol. Mass.:39690.94
Organism:Homo sapiens (Human)
Description:P34972
Residue:360
BDBM176632
NameBDBM176632
Synonyms:US9115121, 24
TypeSmall organic molecule
Emp. Form.C21H20FN5O2
Mol. Mass.393.4142
SMILESCOc1ccc2[nH]c(cc2c1)-c1nc(NCCc2ccc(F)cc2)nc(OC)n1