Reaction Details
TargetCannabinoid receptor 2
LigandBDBM176638
Substrate/Competitorn/a
Meas. Tech.Binding Assay
IC50 5±n/a nM
Citation Arnaud, JArtiaga, MBarth, FHortala, LMartinez, SRoux, P 1,3,5-triazine-2-amine derivatives, preparation thereof and diagnostic and therapeutic use thereof US Patent US9115121 Publication Date 8/25/2015
 
Cannabinoid receptor 2
Name:Cannabinoid receptor 2
Type:G Protein-Coupled Receptor (GPCR)
Mol. Mass.:39690.94
Organism:Homo sapiens (Human)
Description:P34972
Residue:360
BDBM176638
NameBDBM176638
Synonyms:US9115121, 30
TypeSmall organic molecule
Emp. Form.C20H17FN4O2
Mol. Mass.364.373
SMILESCOc1nc(NCCc2ccc(F)cc2)nc(n1)-c1cc2ccccc2o1