Reaction Details
TargetCannabinoid receptor 2
LigandBDBM176645
Substrate/Competitorn/a
Meas. Tech.Binding Assay
IC50 1±n/a nM
Citation Arnaud, JArtiaga, MBarth, FHortala, LMartinez, SRoux, P 1,3,5-triazine-2-amine derivatives, preparation thereof and diagnostic and therapeutic use thereof US Patent US9115121 Publication Date 8/25/2015
 
Cannabinoid receptor 2
Name:Cannabinoid receptor 2
Type:G Protein-Coupled Receptor (GPCR)
Mol. Mass.:39690.94
Organism:Homo sapiens (Human)
Description:P34972
Residue:360
BDBM176645
NameBDBM176645
Synonyms:US9115121, 37
TypeSmall organic molecule
Emp. Form.C21H17F2N5O
Mol. Mass.393.3894
SMILESCOc1nc(NCCc2ccc(F)cc2)nc(n1)-c1ccc(F)c2cccnc12