Reaction Details
TargetCannabinoid receptor 2
LigandBDBM176648
Substrate/Competitorn/a
Meas. Tech.Binding Assay
IC50 21±n/a nM
Citation Arnaud, JArtiaga, MBarth, FHortala, LMartinez, SRoux, P 1,3,5-triazine-2-amine derivatives, preparation thereof and diagnostic and therapeutic use thereof US Patent US9115121 Publication Date 8/25/2015
 
Cannabinoid receptor 2
Name:Cannabinoid receptor 2
Type:G Protein-Coupled Receptor (GPCR)
Mol. Mass.:39690.94
Organism:Homo sapiens (Human)
Description:P34972
Residue:360
BDBM176648
NameBDBM176648
Synonyms:US9115121, 40
TypeSmall organic molecule
Emp. Form.C21H18FN5O
Mol. Mass.375.3989
SMILESCOc1nc(NCCc2ccc(F)cc2)nc(n1)-c1cncc2ccccc12