Reaction Details
TargetCannabinoid receptor 2
LigandBDBM176608
Substrate/Competitorn/a
Meas. Tech.Binding Assay
IC50 10±n/a nM
Citation Arnaud, JArtiaga, MBarth, FHortala, LMartinez, SRoux, P 1,3,5-triazine-2-amine derivatives, preparation thereof and diagnostic and therapeutic use thereof US Patent US9115121 Publication Date 8/25/2015
 
Cannabinoid receptor 2
Name:Cannabinoid receptor 2
Type:G Protein-Coupled Receptor (GPCR)
Mol. Mass.:39690.94
Organism:Homo sapiens (Human)
Description:P34972
Residue:360
BDBM176608
NameBDBM176608
Synonyms:US9115121, 63
TypeSmall organic molecule
Emp. Form.C22H22ClFN4O4
Mol. Mass.460.886
SMILESCCOC(=O)COc1cc(ccc1Cl)-c1nc(NCCc2ccc(F)cc2)nc(OC)n1