Reaction Details
TargetLysosomal acid glucosylceramidase
LigandBDBM175501
Substrate/Competitorn/a
Meas. Tech.Enzyme Assay
pH4.5±n/a
Ki 406060±56340 nM
IC50 979900±137000 nM
EC50 266100±47700 nM
Commentsextracted
Citation Wustman, BA Method for the treatment of neurological disorders by enhancing the activity of beta-glucocerebrosidase US Patent US9119845 Publication Date 9/1/2015
 
Lysosomal acid glucosylceramidase
Name:Lysosomal acid glucosylceramidase
Type:Enzyme
Mol. Mass.:57628.24
Organism:Mus musculus (Mouse)
Description:P17439
Residue:515
BDBM175501
NameBDBM175501
Synonyms:US9119845, 2
TypeSmall organic molecule
Emp. Form.C12H24O3
Mol. Mass.216.3172
SMILESCCCCCC1CC[C@@H](O)[C@H](O)[C@H]1CO