Reaction Details
TargetLysosomal acid glucosylceramidase
LigandBDBM175505
Substrate/Competitorn/a
Meas. Tech.Enzyme Assay
pH4.5±n/a
Ki 82990±25600 nM
IC50 200270±61780 nM
EC50 115300±18500 nM
Commentsextracted
Citation Wustman, BA Method for the treatment of neurological disorders by enhancing the activity of beta-glucocerebrosidase US Patent US9119845 Publication Date 9/1/2015
 
Lysosomal acid glucosylceramidase
Name:Lysosomal acid glucosylceramidase
Type:Enzyme
Mol. Mass.:57628.24
Organism:Mus musculus (Mouse)
Description:P17439
Residue:515
BDBM175505
NameBDBM175505
Synonyms:US9119845, 6
TypeSmall organic molecule
Emp. Form.C13H19NO3
Mol. Mass.237.2949
SMILESOC[C@@H]1[C@@H](O)[C@H](O)CCN1Cc1ccccc1